BTP
type: Concept
type: Thing
type: NamedIndividual
type: Service
label: Beats Transfer Protocol allows for the discovery and control of devices
notation: btp
term status: stable
date: 2014-02-17
modified: 2014-06-27
description: Beats Transfer Protocol allows for the discovery and control of devices
in dataset: service

Yunho Huh
type: Agent

TCP
type: Concept
type: Thing
type: NamedIndividual
type: Protocol
label: Transmission Control
notation: tcp
term status: stable
description: Transmission Control
IANA ref: RFC9293
in dataset: protocol
has part: BTP

RFC9293
type: Document

btp
type: Document
primary topic: BTP