CCTV
type: Concept
type: Thing
type: NamedIndividual
type: Service
label: IP and Closed-Circuit Television for Securitiy applications
notation: cctv
term status: stable
description: IP and Closed-Circuit Television for Securitiy applications
in dataset: service

Frank Rottmann
type: Agent

cctv
type: Document
primary topic: CCTV