DOTS-CALL-HOME
type: Concept
type: Thing
type: NamedIndividual
type: Service
label: DOTS Signal Channel Call Home Protocol. The service name is used to construct the SRV service names "_dots-call-home._udp" and "_dots-call-home._tcp" for discovering Call Home DOTS clients used to establish DOTS signal channel call home.
notation: dots-call-home
term status: stable
date: 2020-11-19
description: DOTS Signal Channel Call Home Protocol. The service name is used to construct the SRV service names "_dots-call-home._udp" and "_dots-call-home._tcp" for discovering Call Home DOTS clients used to establish DOTS signal channel call home.
IANA ref: RFC8973
in dataset: service

RFC8973
type: Document

IETF Chair
type: Agent

UDP
type: Concept
type: Thing
type: NamedIndividual
type: Protocol
label: User Datagram
notation: udp
term status: stable
description: User Datagram
IANA ref: RFC768
in dataset: protocol
has part: DOTS-CALL-HOME

RFC768
type: Document

Jon Postel
type: Agent

TCP
type: Concept
type: Thing
type: NamedIndividual
type: Protocol
label: Transmission Control
notation: tcp
term status: stable
description: Transmission Control
IANA ref: RFC9293
in dataset: protocol
has part: DOTS-CALL-HOME

RFC9293
type: Document

dots-call-home
type: Document
primary topic: DOTS-CALL-HOME