DSGSYNC
type: Concept
type: Thing
type: NamedIndividual
type: Service
label: Datacolor SpyderGallery Desktop Sync Protocol
notation: dsgsync
term status: stable
date: 2011-10-14
description: Datacolor SpyderGallery Desktop Sync Protocol
in dataset: service

Heath Barber
type: Agent

dsgsync
type: Document
primary topic: DSGSYNC