DSL-SYNC
type: Concept
type: Thing
type: NamedIndividual
type: Service
label: Data Synchronization Protocol for Discovery Software products
notation: dsl-sync
term status: stable
description: Data Synchronization Protocol for Discovery Software products
in dataset: service

John Hogg
type: Agent

dsl-sync
type: Document
primary topic: DSL-SYNC