EB-AMUZI
type: Concept
type: Thing
type: NamedIndividual
type: Service
label: Amuzi peer-to-peer session synchronization protocol
notation: eb-amuzi
term status: stable
description: Amuzi peer-to-peer session synchronization protocol
in dataset: service

Zachary Gramana
type: Agent

eb-amuzi
type: Document
primary topic: EB-AMUZI