HPR-TOOLWIN
type: Concept
type: Thing
type: NamedIndividual
type: Service
label: HP Remote System that houses compilers and tools for Microsoft Windows Systems
notation: hpr-toolwin
term status: stable
description: HP Remote System that houses compilers and tools for Microsoft Windows Systems
in dataset: service

Jeffrey J. Walls
type: Agent

hpr-toolwin
type: Document
primary topic: HPR-TOOLWIN