HPR-TSTWIN
type: Concept
type: Thing
type: NamedIndividual
type: Service
label: HP Remote Test System for Microsoft Windows Systems
notation: hpr-tstwin
term status: stable
description: HP Remote Test System for Microsoft Windows Systems
in dataset: service

Jeffrey J. Walls
type: Agent

hpr-tstwin
type: Document
primary topic: HPR-TSTWIN