INETFS
type: Concept
type: Thing
type: NamedIndividual
type: Service
label: A File System using TLS over a wide area network
notation: inetfs
term status: stable
date: 2016-01-28
description: A File System using TLS over a wide area network
ports: 7775 (TCP)
in dataset: service

Roger Allan
type: Agent

7775 (TCP)
type: Port
notation: 7775

TCP
type: Concept
type: Thing
type: NamedIndividual
type: Protocol
label: Transmission Control
notation: tcp
term status: stable
description: Transmission Control
IANA ref: RFC9293
in dataset: protocol
has part: 7775 (TCP)

RFC9293
type: Document

inetfs
type: Document
primary topic: INETFS