IO-DIST-DATA
type: Concept
type: Thing
type: NamedIndividual
type: Service
label: Dist. I/O Comm. Service Data and Control
notation: io-dist-data
term status: stable
date: 2010-03-22
description: Dist. I/O Comm. Service Data and Control
ports: 5728 (TCP)
in dataset: service

Harish Kuttan
type: Agent

5728 (TCP)
type: Port
notation: 5728

TCP
type: Concept
type: Thing
type: NamedIndividual
type: Protocol
label: Transmission Control
notation: tcp
term status: stable
description: Transmission Control
IANA ref: RFC9293
in dataset: protocol
has part: 5728 (TCP)

RFC9293
type: Document

io-dist-data
type: Document
primary topic: IO-DIST-DATA