KEYNOTEPAIRING
type: Concept
type: Thing
type: NamedIndividual
type: Service
label: KeynotePairing is used to pair Keynote Remote with Keynote
notation: keynotepairing
term status: stable
date: 2011-10-12
description: KeynotePairing is used to pair Keynote Remote with Keynote
in dataset: service

Brad Vaughan
type: Agent

TCP
type: Concept
type: Thing
type: NamedIndividual
type: Protocol
label: Transmission Control
notation: tcp
term status: stable
description: Transmission Control
IANA ref: RFC9293
in dataset: protocol
has part: KEYNOTEPAIRING

RFC9293
type: Document

keynotepairing
type: Document
primary topic: KEYNOTEPAIRING