KTICKETS-REST
type: Concept
type: Thing
type: NamedIndividual
type: Service
label: ktickets REST API for event management and ticketing systems (embedded POS devices)
notation: ktickets-rest
term status: stable
date: 2014-04-04
description: ktickets REST API for event management and ticketing systems (embedded POS devices)
ports: 4331 (TCP)
in dataset: service

MANG Ioan-Alexandru
type: Agent

4331 (TCP)
type: Port
notation: 4331

TCP
type: Concept
type: Thing
type: NamedIndividual
type: Protocol
label: Transmission Control
notation: tcp
term status: stable
description: Transmission Control
IANA ref: RFC9293
in dataset: protocol
has part: 4331 (TCP)

RFC9293
type: Document

ktickets-rest
type: Document
primary topic: KTICKETS-REST