M3DA
type: Concept
type: Thing
type: NamedIndividual
type: Service
label: M3DA is used for efficient machine-to-machine communications
notation: m3da
term status: stable
date: 2013-02-22
description: M3DA is used for efficient machine-to-machine communications
ports: 44900 (TCP)
in dataset: service

Didier Lahay
type: Agent

44900 (TCP)
type: Port
notation: 44900

TCP
type: Concept
type: Thing
type: NamedIndividual
type: Protocol
label: Transmission Control
notation: tcp
term status: stable
description: Transmission Control
IANA ref: RFC9293
in dataset: protocol
has part: 44900 (TCP)

RFC9293
type: Document

m3da
type: Document
primary topic: M3DA