MIELESEMIPROF
type: Concept
type: Thing
type: NamedIndividual
type: Service
label: Miele protocol for semi prof. appliances
notation: mielesemiprof
term status: stable
date: 2018-04-20
description: Miele protocol for semi prof. appliances
in dataset: service

Dr. Nils Langhammer
type: Agent

TCP
type: Concept
type: Thing
type: NamedIndividual
type: Protocol
label: Transmission Control
notation: tcp
term status: stable
description: Transmission Control
IANA ref: RFC9293
in dataset: protocol
has part: MIELESEMIPROF

RFC9293
type: Document

mielesemiprof
type: Document
primary topic: MIELESEMIPROF