MXIM-ICE
type: Concept
type: Thing
type: NamedIndividual
type: Service
label: Maxim Integrated Products In-circuit Emulator
notation: mxim-ice
term status: stable
description: Maxim Integrated Products In-circuit Emulator
in dataset: service

Zach Metzinger
type: Agent

mxim-ice
type: Document
primary topic: MXIM-ICE