NPQES-TEST
type: Concept
type: Thing
type: NamedIndividual
type: Service
label: Network Performance Quality Evaluation System Test Service
notation: npqes-test
term status: stable
date: 2010-06-28
description: Network Performance Quality Evaluation System Test Service
ports: 4703 (TCP)
in dataset: service

Zhengli
type: Agent

4703 (TCP)
type: Port
notation: 4703

TCP
type: Concept
type: Thing
type: NamedIndividual
type: Protocol
label: Transmission Control
notation: tcp
term status: stable
description: Transmission Control
IANA ref: RFC9293
in dataset: protocol
has part: 4703 (TCP)

RFC9293
type: Document

npqes-test
type: Document
primary topic: NPQES-TEST