NTLX-ENT
type: Concept
type: Thing
type: NamedIndividual
type: Service
label: American Dynamics Intellex Enterprise Management Service
notation: ntlx-ent
term status: stable
description: American Dynamics Intellex Enterprise Management Service
in dataset: service

Gary Sands
type: Agent

ntlx-ent
type: Document
primary topic: NTLX-ENT