OSPF
type: Concept
type: Thing
type: NamedIndividual
type: Service
label: Open Shortest Path First Interior GW Protocol
notation: ospf
term status: stable
description: Open Shortest Path First Interior GW Protocol
in dataset: service

ospf
type: Document
primary topic: OSPF