PCEP
type: Concept
type: Thing
type: NamedIndividual
type: Service
label: Path Computation Element Communication Protocol
notation: pcep
term status: stable
description: Path Computation Element Communication Protocol
ports: 4189 (TCP)
in dataset: service

4189 (TCP)
type: Port
notation: 4189

TCP
type: Concept
type: Thing
type: NamedIndividual
type: Protocol
label: Transmission Control
notation: tcp
term status: stable
description: Transmission Control
IANA ref: RFC9293
in dataset: protocol
has part: 4189 (TCP)

RFC9293
type: Document

pcep
type: Document
primary topic: PCEP