POCH
type: Concept
type: Thing
type: NamedIndividual
type: Service
label: Parallel OperatiOn and Control Heuristic (Pooch)
notation: poch
term status: stable
description: Parallel OperatiOn and Control Heuristic (Pooch)
in dataset: service

Dean Dauger
type: Agent

poch
type: Document
primary topic: POCH