ROUTER
type: Concept
type: Thing
type: NamedIndividual
type: Service
label: local routing process (on site); uses variant of Xerox NS routing information protocol - RIP
notation: router
term status: stable
description: local routing process (on site); uses variant of Xerox NS routing information protocol - RIP
ports: 520 (UDP)
in dataset: service

520 (UDP)
type: Port
notation: 520

UDP
type: Concept
type: Thing
type: NamedIndividual
type: Protocol
label: User Datagram
notation: udp
term status: stable
description: User Datagram
IANA ref: RFC768
in dataset: protocol
has part: 520 (UDP)

RFC768
type: Document

Jon Postel
type: Agent

router
type: Document
primary topic: ROUTER